mucky-a
type: LexicalEntry
canonical form: mucky
sense: 00424139-s
part of speech: adjective

muddy-a
type: LexicalEntry
canonical form: muddy
sense: 00424139-s
part of speech: adjective

00424139-s
type: LexicalConcept
in scheme: en-word.net
definition: dirty and messy; covered with mud or muck
example: muddy boots
example: a mucky stable
ili: i2393
lexfile: adj.all
part of speech: adjective satellite
similar: https://en-word.net/synset/00420808-a