dislocate-v
type: LexicalEntry
canonical form: dislocate
sense: 00415748-v
part of speech: verb

00415748-v
type: LexicalConcept
in scheme: en-word.net
definition: put out of its usual place, position, or relationship
example: The colonists displaced the natives
ili: i23796
lexfile: verb.change
part of speech: verb
hypernym: 02017423-v