settle-v
type: LexicalEntry
canonical form: settle
sense: 00414801-v
part of speech: verb

locate-v
type: LexicalEntry
canonical form: locate
sense: 00414801-v
part of speech: verb

00414801-v
type: LexicalConcept
in scheme: en-word.net
definition: take up residence and become established
example: The immigrants settled in the Midwest
ili: i23792
lexfile: verb.change
part of speech: verb
entails: 01859592-v
hypernym: 02372362-v