indentation-n
type: LexicalEntry
canonical form: indentation
sense: 00407760-n
part of speech: noun

00407760-n
type: LexicalConcept
in scheme: en-word.net
definition: the act of cutting into an edge with toothlike notches or angular incisions
ili: i37546
lexfile: noun.act
part of speech: noun
hypernym: 00405224-n