interlock-v
type: LexicalEntry
canonical form: interlock
sense: 00406004-v
part of speech: verb

mesh-v
type: LexicalEntry
canonical form: mesh
sense: 00406004-v
part of speech: verb

00406004-v
type: LexicalConcept
in scheme: en-word.net
definition: coordinate in such a way that all parts work together effectively
ili: i23753
lexfile: verb.change
part of speech: verb
hypernym: 00405549-v