transformation-n
type: LexicalEntry
canonical form: transformation
sense: 00399838-n
part of speech: noun

00399838-n
type: LexicalConcept
in scheme: en-word.net
definition: (genetics) modification of a cell or bacterium by the uptake and incorporation of exogenous DNA
ili: i37501
lexfile: noun.act
part of speech: noun
domain topic: 06085077-n
hypernym: 00376871-n