intense-a
type: LexicalEntry
canonical form: intense
sense: 00394744-s
part of speech: adjective

vivid-a
type: LexicalEntry
canonical form: vivid
sense: 00394744-s
part of speech: adjective

00394744-s
type: LexicalConcept
in scheme: en-word.net
definition: (of color) having the highest saturation
example: vivid green
example: intense blue
ili: i2226
lexfile: adj.all
part of speech: adjective satellite
similar: https://en-word.net/synset/00394569-a