pall-v
type: LexicalEntry
canonical form: pall
sense: 00392844-v
part of speech: verb

00392844-v
type: LexicalConcept
in scheme: en-word.net
definition: lose strength or effectiveness; become or appear boring, insipid, or tiresome (to)
example: the course palled on her
ili: i23693
lexfile: verb.change
part of speech: verb
hypernym: 00223926-v