suffocate-v
type: LexicalEntry
canonical form: suffocate
sense: 00391905-v
part of speech: verb

choke-v
type: LexicalEntry
canonical form: choke
sense: 00391905-v
part of speech: verb

00391905-v
type: LexicalConcept
in scheme: en-word.net
definition: become stultified, suppressed, or stifled
example: He is suffocating — living at home with his aged parents in the small village
ili: i23687
lexfile: verb.change
part of speech: verb
hypernym: 02632685-v
similar: 00391723-v