emaciate-v
type: LexicalEntry
canonical form: emaciate
sense: 00389909-v
part of speech: verb

00389909-v
type: LexicalConcept
in scheme: en-word.net
definition: grow weak and thin or waste away physically
example: She emaciated during the chemotherapy
ili: i23676
lexfile: verb.change
part of speech: verb
hypernym: 00145958-v