resile-v
type: LexicalEntry
canonical form: resile
sense: 00388351-v
part of speech: verb

00388351-v
type: LexicalConcept
in scheme: en-word.net
definition: return to the original position or state after being stretched or compressed
example: The rubber tubes resile
ili: i23670
lexfile: verb.change
part of speech: verb
hypernym: 00387981-v