convert-v
type: LexicalEntry
canonical form: convert
sense: 00385082-v
part of speech: verb

00385082-v
type: LexicalConcept
in scheme: en-word.net
definition: change religious beliefs, or adopt a religious belief
example: She converted to Buddhism
ili: i23655
lexfile: verb.change
part of speech: verb
hypernym: 00109468-v
similar: 00386056-v