homecoming-n
type: LexicalEntry
canonical form: homecoming
sense: 00384089-n
part of speech: noun

00384089-n
type: LexicalConcept
in scheme: en-word.net
definition: an annual school or university reunion for graduates
ili: i37418
lexfile: noun.act
part of speech: noun
hypernym: 00383282-n