backfire-v
type: LexicalEntry
canonical form: backfire
sense: 00379694-v
part of speech: verb

00379694-v
type: LexicalConcept
in scheme: en-word.net
definition: set a controlled fire to halt an advancing forest to prairie fire
ili: i23628
lexfile: verb.change
part of speech: verb
hypernym: 00379335-v