exaggeration-n
type: LexicalEntry
canonical form: exaggeration
sense: 00368378-n
part of speech: noun

00368378-n
type: LexicalConcept
in scheme: en-word.net
definition: the act of making something more noticeable than usual
example: the dance involved a deliberate exaggeration of his awkwardness
ili: i37344
lexfile: noun.act
part of speech: noun
hypernym: 00364086-n