tension-n
type: LexicalEntry
canonical form: tension
sense: 00367501-n
part of speech: noun

00367501-n
type: LexicalConcept
in scheme: en-word.net
definition: the action of stretching something tight
example: tension holds the belt in the pulleys
ili: i37339
lexfile: noun.act
part of speech: noun
hypernym: 00367347-n