condense-v
type: LexicalEntry
canonical form: condense
sense: 00366928-v
part of speech: verb

00366928-v
type: LexicalConcept
in scheme: en-word.net
definition: cause a gas or vapor to change into a liquid
example: The cold air condensed the steam
ili: i23566
lexfile: verb.change
part of speech: verb
hypernym: 00139943-v
similar: 00367200-v