subtraction-n
type: LexicalEntry
canonical form: subtraction
sense: 00361583-n
part of speech: noun

deduction-n
type: LexicalEntry
canonical form: deduction
sense: 00361583-n
part of speech: noun

00361583-n
type: LexicalConcept
in scheme: en-word.net
definition: the act of subtracting (removing a part from the whole)
example: he complained about the subtraction of money from their paychecks
ili: i37308
lexfile: noun.act
part of speech: noun
hypernym: 00352464-n