condensing-n
type: LexicalEntry
canonical form: condensing
sense: 00358506-n
part of speech: noun

condensation-n
type: LexicalEntry
canonical form: condensation
sense: 00358506-n
part of speech: noun

00358506-n
type: LexicalConcept
in scheme: en-word.net
definition: the act of increasing the density of something
ili: i37290
lexfile: noun.act
part of speech: noun
hypernym: 00357616-n