devaluation-n
type: LexicalEntry
canonical form: devaluation
sense: 00354818-n
part of speech: noun

00354818-n
type: LexicalConcept
in scheme: en-word.net
definition: the reduction of something's value or worth
ili: i37271
lexfile: noun.act
part of speech: noun
hypernym: 00352464-n