right-n
type: LexicalEntry
canonical form: right
sense: 00351826-n
part of speech: noun

00351826-n
type: LexicalConcept
in scheme: en-word.net
definition: a turn toward the side of the body that is on the south when the person is facing east
example: take a right at the corner
ili: i37254
lexfile: noun.act
part of speech: noun
hypernym: 00350856-n