passing-n
type: LexicalEntry
canonical form: passing
sense: 00341018-n
part of speech: noun

overtaking-n
type: LexicalEntry
canonical form: overtaking
sense: 00341018-n
part of speech: noun

00341018-n
type: LexicalConcept
in scheme: en-word.net
definition: going by something that is moving in order to get in front of it
example: she drove but well but her reckless passing of every car on the road frightened me
ili: i37197
lexfile: noun.act
part of speech: noun
hypernym: 00340289-n