transposition-n
type: LexicalEntry
canonical form: transposition
sense: 00340602-n
part of speech: noun

reversal-n
type: LexicalEntry
canonical form: reversal
sense: 00340602-n
part of speech: noun

00340602-n
type: LexicalConcept
in scheme: en-word.net
definition: the act of reversing the order or place of
ili: i37195
lexfile: noun.act
part of speech: noun
hypernym: 00340289-n