bruise-v
type: LexicalEntry
canonical form: bruise
sense: 00340078-v
part of speech: verb

00340078-v
type: LexicalConcept
in scheme: en-word.net
definition: break up into small pieces for food preparation
example: bruise the berries with a wooden spoon and strain them
ili: i23432
lexfile: verb.change
part of speech: verb
domain topic: 00244785-n
hypernym: 00339895-v