snap-v
type: LexicalEntry
canonical form: snap
sense: 00337875-v
part of speech: verb

crack-v
type: LexicalEntry
canonical form: crack
sense: 00337875-v
part of speech: verb

00337875-v
type: LexicalConcept
in scheme: en-word.net
definition: break suddenly and abruptly, as under tension
example: The pipe snapped
ili: i23420
lexfile: verb.change
part of speech: verb
hypernym: 00334996-v