kick-n
type: LexicalEntry
canonical form: kick
sense: 00337631-n
part of speech: noun

kicking-n
type: LexicalEntry
canonical form: kicking
sense: 00337631-n
part of speech: noun

00337631-n
type: LexicalConcept
in scheme: en-word.net
definition: a rhythmic thrusting movement of the legs as in swimming or calisthenics
example: the kick must be synchronized with the arm movements
example: the swimmer's kicking left a wake behind him
ili: i37180
lexfile: noun.act
part of speech: noun
hypernym: 00332776-n