smash-v
type: LexicalEntry
canonical form: smash
sense: 00336733-v
part of speech: verb

dash-v
type: LexicalEntry
canonical form: dash
sense: 00336733-v
part of speech: verb

00336733-v
type: LexicalConcept
in scheme: en-word.net
definition: break into pieces, as by striking or knocking over
example: Smash a plate
ili: i23414
lexfile: verb.change
part of speech: verb
hypernym: 00335806-v
similar: 00335459-v