disturbance-n
type: LexicalEntry
canonical form: disturbance
sense: 00334655-n
part of speech: noun

00334655-n
type: LexicalConcept
in scheme: en-word.net
definition: the act of disturbing something or someone; setting something in motion
ili: i37165
lexfile: noun.act
part of speech: noun
hypernym: 00332776-n