median-a
type: LexicalEntry
canonical form: median
sense: 00331928-s
part of speech: adjective

medial-a
type: LexicalEntry
canonical form: medial
sense: 00331928-s
part of speech: adjective

00331928-s
type: LexicalConcept
in scheme: en-word.net
definition: relating to or situated in or extending toward the middle
ili: i1840
lexfile: adj.all
part of speech: adjective satellite
similar: https://en-word.net/synset/00330729-a