flow-n
type: LexicalEntry
canonical form: flow
sense: 00330053-n
part of speech: noun

stream-n
type: LexicalEntry
canonical form: stream
sense: 00330053-n
part of speech: noun

00330053-n
type: LexicalConcept
in scheme: en-word.net
definition: the act of flowing or streaming; continuous progression
ili: i37145
lexfile: noun.act
part of speech: noun
hypernym: 00280679-n