pickup-n
type: LexicalEntry
canonical form: pickup
sense: 00320002-n
part of speech: noun

00320002-n
type: LexicalConcept
in scheme: en-word.net
definition: the act of taking aboard passengers or freight
ili: i37086
lexfile: noun.act
part of speech: noun
hypernym: 00042637-n