gusty-a
type: LexicalEntry
canonical form: gusty
sense: 00306499-s
part of speech: adjective

puffy-a
type: LexicalEntry
canonical form: puffy
sense: 00306499-s
part of speech: adjective

00306499-s
type: LexicalConcept
in scheme: en-word.net
definition: blowing in puffs or short intermittent blasts
example: puffy off-shore winds
example: gusty winds
ili: i1689
lexfile: adj.all
part of speech: adjective satellite
similar: https://en-word.net/synset/00304526-a