adapt-v
type: LexicalEntry
canonical form: adapt
sense: 00300361-v
part of speech: verb

accommodate-v
type: LexicalEntry
canonical form: accommodate
sense: 00300361-v
part of speech: verb

00300361-v
type: LexicalConcept
in scheme: en-word.net
definition: make fit for, or change to suit a new purpose
example: Adapt our native cuisine to the available food resources of the new country
ili: i23224
lexfile: verb.change
part of speech: verb
hypernym: 00126072-v