procession-n
type: LexicalEntry
canonical form: procession
sense: 00297411-n
part of speech: noun

00297411-n
type: LexicalConcept
in scheme: en-word.net
definition: the group action of a collection of people or animals or vehicles moving ahead in more or less regular formation
example: processions were forbidden
ili: i36959
lexfile: noun.act
part of speech: noun
hypernym: 01082290-n
hypernym: 07968050-n