bombard-v
type: LexicalEntry
canonical form: bombard
sense: 00292386-v
part of speech: verb

00292386-v
type: LexicalConcept
in scheme: en-word.net
definition: direct high energy particles or radiation against
ili: i23185
lexfile: verb.change
part of speech: verb
domain topic: 06100457-n
hypernym: 00292206-v