skip-n
type: LexicalEntry
canonical form: skip
sense: 00290750-n
part of speech: noun

00290750-n
type: LexicalConcept
in scheme: en-word.net
definition: a gait in which steps and hops alternate
ili: i36920
lexfile: noun.act
part of speech: noun
hypernym: 00287341-n