step-n
type: LexicalEntry
canonical form: step
sense: 00286401-n
part of speech: noun

00286401-n
type: LexicalConcept
in scheme: en-word.net
definition: the act of changing location by raising the foot and setting it down
example: he walked with unsteady steps
ili: i36893
lexfile: noun.act
part of speech: noun
hypernym: 00283971-n