motley-v
type: LexicalEntry
canonical form: motley
sense: 00285429-v
part of speech: verb

parti-color-v
type: LexicalEntry
canonical form: parti-color
sense: 00285429-v
part of speech: verb

00285429-v
type: LexicalConcept
in scheme: en-word.net
definition: make motley; color with different colors
ili: i23139
lexfile: verb.change
part of speech: verb
hypernym: 00284671-v