coloring-n
type: LexicalEntry
canonical form: coloring
sense: 00275785-n
part of speech: noun

colouring-n
type: LexicalEntry
canonical form: colouring
sense: 00275785-n
part of speech: noun

00275785-n
type: LexicalConcept
in scheme: en-word.net
definition: the act or process of changing the color of something
ili: i36844
lexfile: noun.act
part of speech: noun
hypernym: 00274534-n