dark-a
type: LexicalEntry
canonical form: dark
sense: https://en-word.net/lemma/dark-a#00273948-a
part of speech: adjective

https://en-word.net/synset/00273948-a
type: LexicalConcept
in scheme: en-word.net
definition: devoid of or deficient in light or brightness; shadowed or black
example: sitting in a dark corner
example: a dark day
example: dark shadows
example: dark as the inside of a black cat
ili: i1528
lexfile: adj.all
part of speech: adjective
attribute: 04958550-n
similar: 00274518-s
similar: 00274767-s
similar: 00274934-s
similar: 00275157-s
similar: 00275239-s
similar: 00275417-s
similar: 00275564-s
similar: 00275699-s
similar: 00275837-s
similar: 00275972-s
similar: 00276156-s
similar: 00276352-s
similar: 00276630-s
similar: 00276851-s
similar: 00277092-s
similar: 00277221-s