peg-v
type: LexicalEntry
canonical form: peg
sense: 00272000-v
part of speech: verb

00272000-v
type: LexicalConcept
in scheme: en-word.net
definition: stabilize (the price of a commodity or an exchange rate) by legislation or market operations
example: The weak currency was pegged to the US Dollar
ili: i23075
lexfile: verb.change
part of speech: verb
hypernym: 00271625-v