bright-a
type: LexicalEntry
canonical form: bright
sense: 00271888-s
part of speech: adjective

00271888-s
type: LexicalConcept
in scheme: en-word.net
definition: having lots of light either natural or artificial
example: the room was bright and airy
example: a stage bright with spotlights
ili: i1515
lexfile: adj.all
part of speech: adjective satellite
similar: https://en-word.net/synset/00270855-a