restitution-n
type: LexicalEntry
canonical form: restitution
sense: 00271119-n
part of speech: noun

00271119-n
type: LexicalConcept
in scheme: en-word.net
definition: the act of restoring something to its original state
ili: i36818
lexfile: noun.act
part of speech: noun
hypernym: 00267650-n