worsening-n
type: LexicalEntry
canonical form: worsening
sense: 00267097-n
part of speech: noun

00267097-n
type: LexicalConcept
in scheme: en-word.net
definition: changing something with the result that it becomes worse
ili: i36795
lexfile: noun.act
part of speech: noun
hypernym: 00199979-n