ornamentation-n
type: LexicalEntry
canonical form: ornamentation
sense: 00263586-n
part of speech: noun

embellishment-n
type: LexicalEntry
canonical form: embellishment
sense: 00263586-n
part of speech: noun

00263586-n
type: LexicalConcept
in scheme: en-word.net
definition: the act of adding extraneous decorations to something
ili: i36774
lexfile: noun.act
part of speech: noun
hypernym: 00263092-n