expand-v
type: LexicalEntry
canonical form: expand
sense: 00258155-v
part of speech: verb

00258155-v
type: LexicalConcept
in scheme: en-word.net
definition: become larger in size or volume or quantity
example: his business expanded rapidly
ili: i23003
lexfile: verb.change
part of speech: verb
hypernym: 00231172-v