develop-v
type: LexicalEntry
canonical form: develop
sense: 00254647-v
part of speech: verb

make grow-v
type: LexicalEntry
canonical form: make grow
sense: 00254647-v
part of speech: verb

00254647-v
type: LexicalConcept
in scheme: en-word.net
definition: cause to grow and differentiate in ways conforming to its natural development
example: The perfect climate here develops the grain
example: He developed a new kind of apple
ili: i22984
lexfile: verb.change
part of speech: verb
causes: 00252905-v
causes: 00231172-v
hypernym: 00126072-v
similar: 00171865-v