develop-v
type: LexicalEntry
canonical form: develop
sense: 00252905-v
part of speech: verb

00252905-v
type: LexicalConcept
in scheme: en-word.net
definition: grow, progress, unfold, or evolve through a process of evolution, natural growth, differentiation, or a conducive environment
example: A flower developed on the branch
example: The country developed into a mighty superpower
example: The embryo develops into a fetus
example: This situation has developed over a long time
ili: i22978
lexfile: verb.change
part of speech: verb
hypernym: 00231172-v
similar: 00343635-v