stride-n
type: LexicalEntry
canonical form: stride
sense: 00250854-n
part of speech: noun

00250854-n
type: LexicalConcept
in scheme: en-word.net
definition: significant progress (especially in the phrase ‘make strides’)
example: they made big strides in productivity
ili: i36705
lexfile: noun.act
part of speech: noun
hypernym: 00250368-n