breathe-v
type: LexicalEntry
canonical form: breathe
sense: 00240640-v
part of speech: verb

00240640-v
type: LexicalConcept
in scheme: en-word.net
definition: reach full flavor by absorbing air and being let to stand after having been uncorked
example: This rare Bordeaux must be allowed to breathe for at least 2 hours
ili: i22916
lexfile: verb.change
part of speech: verb
hypernym: 00239753-v